Note: This is a beta release of Red Hat Bugzilla 5.0. The data contained within is a snapshot of the live data so any changes you make will not be reflected in the production Bugzilla. Also email is disabled so feel free to test any aspect of the site that you want. File any problems you find or give feedback here.
Bug 232871 - wireless regression on RHEL4 U4, kdenetwork compilation fails
Summary: wireless regression on RHEL4 U4, kdenetwork compilation fails
Keywords:
Status: CLOSED WONTFIX
Alias: None
Product: Red Hat Enterprise Linux 4
Classification: Red Hat
Component: wireless-tools
Version: 4.4
Hardware: All
OS: Linux
medium
medium
Target Milestone: ---
: ---
Assignee: Dan Williams
QA Contact:
URL:
Whiteboard:
Depends On:
Blocks:
TreeView+ depends on / blocked
 
Reported: 2007-03-19 05:47 UTC by Boris B. Zhmurov
Modified: 2012-06-20 16:08 UTC (History)
1 user (show)

Fixed In Version:
Doc Type: Bug Fix
Doc Text:
Clone Of:
Environment:
Last Closed: 2012-06-20 16:08:17 UTC


Attachments (Terms of Use)

Description Boris B. Zhmurov 2007-03-19 05:47:07 UTC
Description of problem:
Look's like wireless-tools-28-0.pre16.3.3.EL4 has a regression, because 
with version 28-X-preX  package kdenetwork src.rpm can't be builded



Version-Release number of selected component (if applicable):
wireless-tools-28-0.pre16.3.3.EL4


How reproducible:
Install wireless-tools-28-0.pre16.3.3.EL4 and try to rpmbuild --rebuild
kdenetwork-3.3.1-2.3.src.rpm



Steps to Reproduce:
1. rpm -i wireless-tools-28-0.pre16.3.3.EL4.i386.rpm
2. rpmbuild --rebuild kdenetwork-3.3.1-2.3.src.rpm

  

Actual results:
if g++ -DHAVE_CONFIG_H -I. -I. -I.. -I/usr/include/kde -I/usr/lib/qt-3.3/include
-I/usr/X11R6/include   -DQT_THREAD_SUPPORT -D_REENTRANT -D_FILE_OFFSET_BITS=64 
-Wnon-virtual-dtor -Wno-long-long -Wundef -ansi -D_XOPEN_SOURCE=500
-D_BSD_SOURCE -Wcast-align -Wconversion -Wchar-subscripts -Wall -W
-Wpointer-arith -Wwrite-strings -O2 -O2 -pipe -march=i686 -m32 -D_GNU_SOURCE
-DNDEBUG -DNO_DEBUG -fno-use-cxa-atexit -Wformat-security
-Wmissing-format-attribute -fno-exceptions -fno-check-new -fno-common
-DQT_CLEAN_NAMESPACE -DQT_NO_ASCII_CAST -DQT_NO_STL -DQT_NO_COMPAT
-DQT_NO_TRANSLATION  -MT interface_wireless_wirelessextensions.o -MD -MP -MF
".deps/interface_wireless_wirelessextensions.Tpo" \
  -c -o interface_wireless_wirelessextensions.o `test -f
'interface_wireless_wirelessextensions.cpp' || echo
'./'`interface_wireless_wirelessextensions.cpp; \
then mv -f ".deps/interface_wireless_wirelessextensions.Tpo"
".deps/interface_wireless_wirelessextensions.Po"; \
else rm -f ".deps/interface_wireless_wirelessextensions.Tpo"; exit 1; \
fi
interface_wireless_wirelessextensions.cpp: In member function `virtual bool
Interface_wireless_wirelessextensions::poll_device_info()':
interface_wireless_wirelessextensions.cpp:371: error: `iw_pr_ether' was not
declared in this scope
interface_wireless_wirelessextensions.cpp:371: warning: unused variable
'iw_pr_ether'
make[3]: *** [interface_wireless_wirelessextensions.o] Error 1
make[3]: Leaving directory `/usr/src/redhat/BUILD/kdenetwork-3.3.1/wifi'
make[2]: *** [all-recursive] Error 1
make[2]: Leaving directory `/usr/src/redhat/BUILD/kdenetwork-3.3.1/wifi'
make[1]: *** [all-recursive] Error 1
make[1]: Leaving directory `/usr/src/redhat/BUILD/kdenetwork-3.3.1'
make: *** [all] Error 2
error: Bad exit status from /var/tmp/rpm-tmp.62030 (%build) 




Expected results:
Successful build of kdenetwork.



Additional info:

Comment 2 Jiri Pallich 2012-06-20 16:08:17 UTC
Thank you for submitting this issue for consideration in Red Hat Enterprise Linux. The release for which you requested us to review is now End of Life. 
Please See https://access.redhat.com/support/policy/updates/errata/

If you would like Red Hat to re-consider your feature request for an active release, please re-open the request via appropriate support channels and provide additional supporting details about the importance of this issue.


Note You need to log in before you can comment on or make changes to this bug.