Note: This is a beta release of Red Hat Bugzilla 5.0. The data contained within is a snapshot of the live data so any changes you make will not be reflected in the production Bugzilla. Also email is disabled so feel free to test any aspect of the site that you want. File any problems you find or give feedback here.
Bug 163032 - missing buildrequires groff
Summary: missing buildrequires groff
Alias: None
Product: Fedora
Classification: Fedora
Component: cyrus-sasl
Version: rawhide
Hardware: All
OS: Linux
Target Milestone: ---
Assignee: Nalin Dahyabhai
QA Contact: Brian Brock
: 176503 (view as bug list)
Depends On:
TreeView+ depends on / blocked
Reported: 2005-07-12 12:25 UTC by Karsten Hopp
Modified: 2007-11-30 22:11 UTC (History)
1 user (show)

Fixed In Version: 2.1.21-5
Doc Type: Bug Fix
Doc Text:
Clone Of:
Last Closed: 2005-09-09 15:02:16 UTC

Attachments (Terms of Use)

Description Karsten Hopp 2005-07-12 12:25:23 UTC
From Bugzilla Helper:
User-Agent: Mozilla/5.0 (X11; U; Linux i686; de-DE; rv:1.7.8) Gecko/20050623 Fedora/1.0.4-5 Firefox/1.0.4

Description of problem:
Making install in saslauthd
make[1]: Entering directory `/builddir/build/BUILD/cyrus-sasl-2.1.20/cyrus-sasl-2.1.20/build-shared/saslauthd'
make[2]: Entering directory `/builddir/build/BUILD/cyrus-sasl-2.1.20/cyrus-sasl-2.1.20/build-shared/saslauthd'
test -z "/usr/sbin" || mkdir -p -- "/var/tmp/cyrus-sasl-root/usr/sbin"
  /usr/bin/install -c 'saslauthd' '/var/tmp/cyrus-sasl-root/usr/sbin/saslauthd'
nroff -mdoc ../../saslauthd/saslauthd.mdoc > ../../saslauthd/saslauthd.8
/bin/sh: nroff: command not found
make[2]: *** [saslauthd.8] Error 127
make[2]: Leaving directory `/builddir/build/BUILD/cyrus-sasl-2.1.20/cyrus-sasl-2.1.20/build-shared/saslauthd'
make[1]: *** [install-am] Error 2
make[1]: Leaving directory `/builddir/build/BUILD/cyrus-sasl-2.1.20/cyrus-sasl-2.1.20/build-shared/saslauthd'
make: *** [install-recursive] Error 1
error: Bad exit status from /var/tmp/rpm-tmp.27686 (%install)

Version-Release number of selected component (if applicable):

How reproducible:

Steps to Reproduce:
1. remove groff (or install minimal chroot with mock)
2. build cyrus-sasl
3. check results

Additional info:

Comment 1 Nalin Dahyabhai 2005-09-09 15:02:16 UTC
Fixing for Raw Hide.

Comment 2 Nalin Dahyabhai 2005-12-27 22:38:04 UTC
*** Bug 176503 has been marked as a duplicate of this bug. ***

Note You need to log in before you can comment on or make changes to this bug.